Reaction Details
TargetCytochrome P450 2C9
LigandBDBM50440359
Substrate/Competitorn/a
Meas. Tech.ChEMBL_983549 (CHEMBL2429619)
IC50>10000±n/a nM
Citation Grädler, UBomke, JMusil, DDresing, VLehmann, MHölzemann, GGreiner, HEsdar, CKrier, MHeinrich, T Fragment-based discovery of focal adhesion kinase inhibitors. Bioorg Med Chem Lett23:5401-9 (2013) 
 
Cytochrome P450 2C9
Name:Cytochrome P450 2C9
Type:Enzyme
Mol. Mass.:55636.33
Organism:Homo sapiens (Human)
Description:P11712
Residue:490
BDBM50440359
NameBDBM50440359
Synonyms:CHEMBL2425155
TypeSmall organic molecule
Emp. Form.C24H27N7O
Mol. Mass.429.5175
SMILESCc1ccc(cc1)-n1nc(cc1NC(=O)Nc1ccc(cc1)-c1nncn1C)C(C)(C)C