Reaction Details
TargetProtein-tyrosine kinase 2-beta
LigandBDBM50440370
Substrate/Competitorn/a
Meas. Tech.ChEMBL_983670 (CHEMBL2427450)
IC50 414±n/a nM
Citation Grädler, UBomke, JMusil, DDresing, VLehmann, MHölzemann, GGreiner, HEsdar, CKrier, MHeinrich, T Fragment-based discovery of focal adhesion kinase inhibitors. Bioorg Med Chem Lett23:5401-9 (2013) 
 
Protein-tyrosine kinase 2-beta
Name:Protein-tyrosine kinase 2-beta
Type:Protein
Mol. Mass.:115868.80
Organism:Homo sapiens (Human)
Description:Q14289
Residue:1009
BDBM50440370
NameBDBM50440370
Synonyms:CHEMBL2425144
TypeSmall organic molecule
Emp. Form.C26H27N9O
Mol. Mass.481.5523
SMILESCc1ccc(cc1)-n1nc(cc1NC(=O)Nc1ccc(cc1)-n1cnc2c(N)ncnc12)C(C)(C)C