Reaction Details
TargetCytochrome P450 1A2
LigandBDBM50440354
Substrate/Competitorn/a
Meas. Tech.ChEMBL_983551 (CHEMBL2429621)
IC50>10000±n/a nM
Citation Grädler, UBomke, JMusil, DDresing, VLehmann, MHölzemann, GGreiner, HEsdar, CKrier, MHeinrich, T Fragment-based discovery of focal adhesion kinase inhibitors. Bioorg Med Chem Lett23:5401-9 (2013) 
 
Cytochrome P450 1A2
Name:Cytochrome P450 1A2
Type:Enzyme
Mol. Mass.:58423.38
Organism:Homo sapiens (Human)
Description:P05177
Residue:516
BDBM50440354
NameBDBM50440354
Synonyms:CHEMBL2425160
TypeSmall organic molecule
Emp. Form.C27H29N5O2
Mol. Mass.455.5515
SMILESCOc1ccc(cn1)-c1ccc(NC(=O)Nc2cc(nn2-c2ccc(C)cc2)C(C)(C)C)cc1