Reaction Details
TargetCytochrome P450 1A2
LigandBDBM50440357
Substrate/Competitorn/a
Meas. Tech.ChEMBL_983551 (CHEMBL2429621)
IC50>10000±n/a nM
Citation Grädler, UBomke, JMusil, DDresing, VLehmann, MHölzemann, GGreiner, HEsdar, CKrier, MHeinrich, T Fragment-based discovery of focal adhesion kinase inhibitors. Bioorg Med Chem Lett23:5401-9 (2013) 
 
Cytochrome P450 1A2
Name:Cytochrome P450 1A2
Type:Enzyme
Mol. Mass.:58423.38
Organism:Homo sapiens (Human)
Description:P05177
Residue:516
BDBM50440357
NameBDBM50440357
Synonyms:CHEMBL2425157
TypeSmall organic molecule
Emp. Form.C26H28N6O
Mol. Mass.440.5401
SMILESCc1ccc(cc1)-n1nc(cc1NC(=O)Nc1ccc(cc1)-c1ccc(N)nc1)C(C)(C)C