Reaction Details
TargetFocal adhesion kinase 1
LigandBDBM50440364
Substrate/Competitorn/a
Meas. Tech.ChEMBL_983671 (CHEMBL2427451)
Kd 9020±n/a nM
Citation Grädler, UBomke, JMusil, DDresing, VLehmann, MHölzemann, GGreiner, HEsdar, CKrier, MHeinrich, T Fragment-based discovery of focal adhesion kinase inhibitors. Bioorg Med Chem Lett23:5401-9 (2013) 
 
Focal adhesion kinase 1
Name:Focal adhesion kinase 1
Type:Tyrosine-protein kinase
Mol. Mass.:119233.17
Organism:Homo sapiens (Human)
Description:Q05397
Residue:1052
BDBM50440364
NameBDBM50440364
Synonyms:CHEMBL2425150
TypeSmall organic molecule
Emp. Form.C25H28N6O
Mol. Mass.428.5294
SMILESCc1cncn1-c1ccc(NC(=O)Nc2cc(nn2-c2ccc(C)cc2)C(C)(C)C)cc1