Reaction Details
TargetFocal adhesion kinase 1
LigandBDBM50440375
Substrate/Competitorn/a
Meas. Tech.ChEMBL_983671 (CHEMBL2427451)
Kd 290000±n/a nM
Citation Grädler, UBomke, JMusil, DDresing, VLehmann, MHölzemann, GGreiner, HEsdar, CKrier, MHeinrich, T Fragment-based discovery of focal adhesion kinase inhibitors. Bioorg Med Chem Lett23:5401-9 (2013) 
 
Focal adhesion kinase 1
Name:Focal adhesion kinase 1
Type:Tyrosine-protein kinase
Mol. Mass.:119233.17
Organism:Homo sapiens (Human)
Description:Q05397
Residue:1052
BDBM50440375
NameBDBM50440375
Synonyms:CHEMBL2425139
TypeSmall organic molecule
Emp. Form.C12H13N3O
Mol. Mass.215.2511
SMILESC1CN(CCO1)c1ncnc2ccccc12