Reaction Details
TargetTranslocator protein
LigandBDBM50440737
Substrate/Competitorn/a
Meas. Tech.ChEMBL_986338 (CHEMBL2433829)
Ki 2540±n/a nM
Citation Peddibhotla, SHedrick, MPHershberger, PMaloney, PRLi, YMilewski, MGosalia, PGray, WMehta, ASugarman, EHood, BSuyama, ENguyen, KHeynen-Genel, SVasile, SSalaniwal, SStonich, DSu, YMangravita-Novo, AVicchiarelli, MRoth, GPSmith, LHChung, TDHanson, GRThomas, JBCaron, MGBarak, LSPinkerton, AB Discovery of ML314, a Brain Penetrant Non-Peptidic?-Arrestin Biased Agonist of the Neurotensin NTR1 Receptor. ACS Med Chem Lett4:846-851 (2013) 
 
Translocator protein
Name:Translocator protein
Type:Enzyme
Mol. Mass.:18834.74
Organism:Homo sapiens (Human)
Description:P30536
Residue:169
BDBM50440737
NameBDBM50440737
Synonyms:CHEMBL2431120
TypeSmall organic molecule
Emp. Form.C24H28N4O3
Mol. Mass.420.5041
SMILESCOc1ccccc1N1CCN(CC1)c1nc(nc2cc(OC)c(OC)cc12)C1CC1