Reaction Details
TargetNeurotensin receptor type 1
LigandBDBM50440738
Substrate/Competitorn/a
Meas. Tech.ChEMBL_986355 (CHEMBL2433846)
IC50 0.240000±n/a nM
Citation Peddibhotla, SHedrick, MPHershberger, PMaloney, PRLi, YMilewski, MGosalia, PGray, WMehta, ASugarman, EHood, BSuyama, ENguyen, KHeynen-Genel, SVasile, SSalaniwal, SStonich, DSu, YMangravita-Novo, AVicchiarelli, MRoth, GPSmith, LHChung, TDHanson, GRThomas, JBCaron, MGBarak, LSPinkerton, AB Discovery of ML314, a Brain Penetrant Non-Peptidic?-Arrestin Biased Agonist of the Neurotensin NTR1 Receptor. ACS Med Chem Lett4:846-851 (2013) 
 
Neurotensin receptor type 1
Name:Neurotensin receptor type 1
Type:PROTEIN
Mol. Mass.:46278.89
Organism:Homo sapiens (Human)
Description:ChEMBL_1453811
Residue:418
BDBM50440738
NameBDBM50440738
Synonyms:CHEMBL2431105
TypeSmall organic molecule
Emp. Form.C39H51N5O6
Mol. Mass.685.8521
SMILESCOc1cccc(OC)c1-c1cc(nn1-c1ccc(cc1C(C)C)C(=O)N(C)CCCN(C)C)C(=O)NC1(C2CC3CC(C2)CC1C3)C(O)=O