Reaction Details
TargetHistone deacetylase 3
LigandBDBM50440910
Substrate/Competitorn/a
Meas. Tech.ChEMBL_984988 (CHEMBL2433162)
IC50>50000±n/a nM
Citation Blackburn, CBarrett, CChin, JGarcia, KGigstad, KGould, AGutierrez, JHarrison, SHoar, KLynch, CRowland, RSTsu, CRingeling, JXu, H Potent histone deacetylase inhibitors derived from 4-(aminomethyl)-N-hydroxybenzamide with high selectivity for the HDAC6 isoform. J Med Chem56:7201-11 (2013) 
 
Histone deacetylase 3
Name:Histone deacetylase 3
Type:Enzyme
Mol. Mass.:48829.55
Organism:Homo sapiens (Human)
Description:O15379
Residue:428
BDBM50440910
NameBDBM50440910
Synonyms:CHEMBL2431906
TypeSmall organic molecule
Emp. Form.C15H15N3O3
Mol. Mass.285.2979
SMILESCn1cccc1C(=O)N1Cc2ccc(cc2C1)C(=O)NO