Reaction Details
TargetBromodomain-containing protein 4
LigandBDBM50441168
Substrate/Competitorn/a
Meas. Tech.ChEMBL_985086 (CHEMBL2433591)
IC50 398±n/a nM
Citation Mirguet, OGosmini, RToum, JClément, CABarnathan, MBrusq, JMMordaunt, JEGrimes, RMCrowe, MPineau, OAjakane, MDaugan, AJeffrey, PCutler, LHaynes, ACSmithers, NNChung, CWBamborough, PUings, IJLewis, AWitherington, JParr, NPrinjha, RKNicodème, E Discovery of epigenetic regulator I-BET762: lead optimization to afford a clinical candidate inhibitor of the BET bromodomains. J Med Chem56:7501-15 (2013) 
 
Bromodomain-containing protein 4
Name:Bromodomain-containing protein 4
Type:Protein
Mol. Mass.:152264.84
Organism:Homo sapiens (Human)
Description:O60885
Residue:1362
BDBM50441168
NameBDBM50441168
Synonyms:CHEMBL2430873
TypeSmall organic molecule
Emp. Form.C20H19N5O2
Mol. Mass.361.3972
SMILESCCOC(=O)N[C@@H]1N=C(c2ccccc2)c2ccccc2-n2c(C)nnc12