Reaction Details
TargetBromodomain-containing protein 4
LigandBDBM50441174
Substrate/Competitorn/a
Meas. Tech.ChEMBL_985086 (CHEMBL2433591)
IC50 1000±n/a nM
Citation Mirguet, OGosmini, RToum, JClément, CABarnathan, MBrusq, JMMordaunt, JEGrimes, RMCrowe, MPineau, OAjakane, MDaugan, AJeffrey, PCutler, LHaynes, ACSmithers, NNChung, CWBamborough, PUings, IJLewis, AWitherington, JParr, NPrinjha, RKNicodème, E Discovery of epigenetic regulator I-BET762: lead optimization to afford a clinical candidate inhibitor of the BET bromodomains. J Med Chem56:7501-15 (2013) 
 
Bromodomain-containing protein 4
Name:Bromodomain-containing protein 4
Type:Protein
Mol. Mass.:152264.84
Organism:Homo sapiens (Human)
Description:O60885
Residue:1362
BDBM50441174
NameBDBM50441174
Synonyms:CHEMBL2430894
TypeSmall organic molecule
Emp. Form.C26H23N5O3
Mol. Mass.453.4925
SMILESCOc1cccc(c1)C1=NC(NC(=O)OCc2ccccc2)c2nnc(C)n2-c2ccccc12