Reaction Details
TargetBromodomain-containing protein 4
LigandBDBM50441178
Substrate/Competitorn/a
Meas. Tech.ChEMBL_985086 (CHEMBL2433591)
IC50 1259±n/a nM
Citation Mirguet, OGosmini, RToum, JClément, CABarnathan, MBrusq, JMMordaunt, JEGrimes, RMCrowe, MPineau, OAjakane, MDaugan, AJeffrey, PCutler, LHaynes, ACSmithers, NNChung, CWBamborough, PUings, IJLewis, AWitherington, JParr, NPrinjha, RKNicodème, E Discovery of epigenetic regulator I-BET762: lead optimization to afford a clinical candidate inhibitor of the BET bromodomains. J Med Chem56:7501-15 (2013) 
 
Bromodomain-containing protein 4
Name:Bromodomain-containing protein 4
Type:Protein
Mol. Mass.:152264.84
Organism:Homo sapiens (Human)
Description:O60885
Residue:1362
BDBM50441178
NameBDBM50441178
Synonyms:CHEMBL2430890
TypeSmall organic molecule
Emp. Form.C25H20ClN5O2
Mol. Mass.457.912
SMILESCc1nnc2C(NC(=O)OCc3ccccc3)N=C(c3ccccc3)c3cc(Cl)ccc3-n12