Reaction Details
TargetBromodomain-containing protein 2
LigandBDBM50441182
Substrate/Competitorn/a
Meas. Tech.ChEMBL_985088 (CHEMBL2433593)
IC50 1995±n/a nM
Citation Mirguet, OGosmini, RToum, JClément, CABarnathan, MBrusq, JMMordaunt, JEGrimes, RMCrowe, MPineau, OAjakane, MDaugan, AJeffrey, PCutler, LHaynes, ACSmithers, NNChung, CWBamborough, PUings, IJLewis, AWitherington, JParr, NPrinjha, RKNicodème, E Discovery of epigenetic regulator I-BET762: lead optimization to afford a clinical candidate inhibitor of the BET bromodomains. J Med Chem56:7501-15 (2013) 
 
Bromodomain-containing protein 2
Name:Bromodomain-containing protein 2
Type:Protein
Mol. Mass.:88085.95
Organism:Homo sapiens (Human)
Description:P25440
Residue:801
BDBM50441182
NameBDBM50441182
Synonyms:CHEMBL2430886
TypeSmall organic molecule
Emp. Form.C25H22N6O
Mol. Mass.422.4818
SMILESCc1nnc2C(NC(=O)NCc3ccccc3)N=C(c3ccccc3)c3ccccc3-n12