Reaction Details
TargetMacrophage colony-stimulating factor 1 receptor
LigandBDBM119044
Substrate/Competitorn/a
Meas. Tech.ChEMBL_1276356 (CHEMBL3088374)
IC50 0.700000±n/a nM
Citation Illig, CRManthey, CLMeegalla, SKWall, MJChen, JWilson, KJDesJarlais, RLBallentine, SKSchubert, CCrysler, CSChen, YMolloy, CJChaikin, MADonatelli, RRYurkow, EZhou, ZPlayer, MRTomczuk, BE Enhancement of kinase selectivity in a potent class of arylamide FMS inhibitors. Bioorg Med Chem Lett23:6363-9 (2013) 
 
Macrophage colony-stimulating factor 1 receptor
Name:Macrophage colony-stimulating factor 1 receptor
Type:Protein
Mol. Mass.:107979.48
Organism:Homo sapiens (Human)
Description:P07333
Residue:972
BDBM119044
NameBDBM119044
Synonyms:CHEMBL3085833 US8674100, 63
TypeSmall organic molecule
Emp. Form.C28H38N6O2
Mol. Mass.490.6403
SMILESCC(C)(N1CCN(CCO)CC1)c1ccc(NC(=O)c2ncc([nH]2)C#N)c(c1)C1=CCC(C)(C)CC1