Reaction Details
TargetMacrophage colony-stimulating factor 1 receptor
LigandBDBM50443167
Substrate/Competitorn/a
Meas. Tech.ChEMBL_1276354 (CHEMBL3088372)
IC50 68±n/a nM
Citation Illig, CRManthey, CLMeegalla, SKWall, MJChen, JWilson, KJDesJarlais, RLBallentine, SKSchubert, CCrysler, CSChen, YMolloy, CJChaikin, MADonatelli, RRYurkow, EZhou, ZPlayer, MRTomczuk, BE Enhancement of kinase selectivity in a potent class of arylamide FMS inhibitors. Bioorg Med Chem Lett23:6363-9 (2013) 
 
Macrophage colony-stimulating factor 1 receptor
Name:Macrophage colony-stimulating factor 1 receptor
Type:Protein
Mol. Mass.:109173.45
Organism:Mus musculus (Mouse)
Description:P09581
Residue:977
BDBM50443167
NameBDBM50443167
Synonyms:CHEMBL3085977 | US8674100, 76
TypeSmall organic molecule
Emp. Form.C26H34N6O2
Mol. Mass.462.5872
SMILESCC(=O)NCCNC(C)(C)c1ccc(NC(=O)c2ncc([nH]2)C#N)c(c1)C1=CCC(C)(C)CC1