Reaction Details
Target2-C-methyl-D-erythritol 2,4-cyclodiphosphate synthase
LigandBDBM50194153
Substrate/Competitorn/a
Meas. Tech.ChEMBL_1280332 (CHEMBL3095347)
Kd 75000±n/a nM
Citation Zhang, ZJakkaraju, SBlain, JGogol, KZhao, LHartley, RCKarlsson, CAStaker, BLEdwards, TEStewart, LJMyler, PJClare, MBegley, DWHorn, JRHagen, TJ Cytidine derivatives as IspF inhibitors of Burkolderia pseudomallei. Bioorg Med Chem Lett23:6860-3 (2013) 
 
2-C-methyl-D-erythritol 2,4-cyclodiphosphate synthase
Name:2-C-methyl-D-erythritol 2,4-cyclodiphosphate synthase
Type:PROTEIN
Mol. Mass.:17174.90
Organism:Burkholderia pseudomallei (strain K96243)
Description:ChEMBL_107981
Residue:162
BDBM50194153
NameBDBM50194153
Synonyms:5'-CDP CHEMBL425252 Cytidine 5'-diphosphoric acid Cytidine, 5'-(trihydrogen pyrophosphate) | cytidine 5'-(trihydrogen diphosphate)
TypeSmall organic molecule
Emp. Form.C9H15N3O11P2
Mol. Mass.403.1764
SMILESNc1ccn([C@@H]2O[C@H](COP(O)(=O)OP(O)(O)=O)[C@@H](O)[C@H]2O)c(=O)n1