Reaction Details
TargetExtracellular calcium-sensing receptor
LigandBDBM50444173
Substrate/Competitorn/a
Meas. Tech.ChEMBL_1277658 (CHEMBL3096900)
EC50 4.0±n/a nM
Citation Wehn, PMHarrington, PECarlson, TJDavis, JDeprez, PFotsch, CHGrillo, MPLu, JYMorony, SPattabiraman, KPoon, SFReagan, JDSt Jean, DJTemal, TWang, MYang, YHenley, CLively, SE Metabolism-guided discovery of a potent and orally bioavailable urea-based calcimimetic for the treatment of secondary hyperparathyroidism. Bioorg Med Chem Lett23:6625-8 (2013) 
 
Extracellular calcium-sensing receptor
Name:Extracellular calcium-sensing receptor
Type:Protein
Mol. Mass.:120663.13
Organism:Homo sapiens (Human)
Description:P41180
Residue:1078
BDBM50444173
NameBDBM50444173
Synonyms:CHEMBL3093425
TypeSmall organic molecule
Emp. Form.C31H32ClF2N5O4S2
Mol. Mass.676.197
SMILESNS(=O)(=O)c1ccc(cc1)-c1nc(NC(=O)N(CCC(c2ccccc2F)c2ccccc2F)CCN2CCOCC2)sc1Cl