Reaction Details
TargetExtracellular calcium-sensing receptor
LigandBDBM50444176
Substrate/Competitorn/a
Meas. Tech.ChEMBL_1277658 (CHEMBL3096900)
EC50 53±n/a nM
Citation Wehn, PMHarrington, PECarlson, TJDavis, JDeprez, PFotsch, CHGrillo, MPLu, JYMorony, SPattabiraman, KPoon, SFReagan, JDSt Jean, DJTemal, TWang, MYang, YHenley, CLively, SE Metabolism-guided discovery of a potent and orally bioavailable urea-based calcimimetic for the treatment of secondary hyperparathyroidism. Bioorg Med Chem Lett23:6625-8 (2013) 
 
Extracellular calcium-sensing receptor
Name:Extracellular calcium-sensing receptor
Type:Protein
Mol. Mass.:120663.13
Organism:Homo sapiens (Human)
Description:P41180
Residue:1078
BDBM50444176
NameBDBM50444176
Synonyms:CHEMBL3093418
TypeSmall organic molecule
Emp. Form.C31H33FN4O2S
Mol. Mass.544.683
SMILESFc1sc(NC(=O)N(CCC(c2ccccc2)c2ccccc2)CCN2CCOCC2)nc1-c1ccccc1