Reaction Details
TargetExtracellular calcium-sensing receptor
LigandBDBM50444179
Substrate/Competitorn/a
Meas. Tech.ChEMBL_1277658 (CHEMBL3096900)
EC50 175±n/a nM
Citation Wehn, PMHarrington, PECarlson, TJDavis, JDeprez, PFotsch, CHGrillo, MPLu, JYMorony, SPattabiraman, KPoon, SFReagan, JDSt Jean, DJTemal, TWang, MYang, YHenley, CLively, SE Metabolism-guided discovery of a potent and orally bioavailable urea-based calcimimetic for the treatment of secondary hyperparathyroidism. Bioorg Med Chem Lett23:6625-8 (2013) 
 
Extracellular calcium-sensing receptor
Name:Extracellular calcium-sensing receptor
Type:Protein
Mol. Mass.:120663.13
Organism:Homo sapiens (Human)
Description:P41180
Residue:1078
BDBM50444179
NameBDBM50444179
Synonyms:CHEMBL3093415
TypeSmall organic molecule
Emp. Form.C30H33N5O2S
Mol. Mass.527.68
SMILESO=C(Nc1nsc(n1)-c1ccccc1)N(CCC(c1ccccc1)c1ccccc1)CCN1CCOCC1