Reaction Details
TargetOxa40
LigandBDBM98824
Substrate/Competitorn/a
Meas. Tech.ChEMBL_1289443 (CHEMBL3117137)
IC50 13000±n/a nM
Citation Blizzard, TAChen, HKim, SWu, JBodner, RGude, CImbriglio, JYoung, KPark, YWOgawa, ARaghoobar, SHairston, NPainter, REWisniewski, DScapin, GFitzgerald, PSharma, NLu, JHa, SHermes, JHammond, ML Discovery of MK-7655, aß-lactamase inhibitor for combination with Primaxin®. Bioorg Med Chem Lett24:780-5 (2014) 
 
Oxa40
Name:Oxa40
Type:Enzyme
Mol. Mass.:30946.50
Organism:Acinetobacter baumannii
Description:Q8RLA6
Residue:275
BDBM98824
NameBDBM98824
Synonyms:US8487093, 222
TypeSmall organic molecule
Emp. Form.C12H19N3O7S
Mol. Mass.349.36
SMILESOS(=O)(=O)ON1[C@H]2CN([C@@H](CC2)C(=O)OC2CCNCC2)C1=O