Reaction Details
TargetOxa40
LigandBDBM98787
Substrate/Competitorn/a
Meas. Tech.ChEMBL_1289443 (CHEMBL3117137)
IC50 4800±n/a nM
Citation Blizzard, TAChen, HKim, SWu, JBodner, RGude, CImbriglio, JYoung, KPark, YWOgawa, ARaghoobar, SHairston, NPainter, REWisniewski, DScapin, GFitzgerald, PSharma, NLu, JHa, SHermes, JHammond, ML Discovery of MK-7655, aß-lactamase inhibitor for combination with Primaxin®. Bioorg Med Chem Lett24:780-5 (2014) 
 
Oxa40
Name:Oxa40
Type:Enzyme
Mol. Mass.:30946.50
Organism:Acinetobacter baumannii
Description:Q8RLA6
Residue:275
BDBM98787
NameBDBM98787
Synonyms:US8487093, 170
TypeSmall organic molecule
Emp. Form.C14H15N3O8S
Mol. Mass.385.349
SMILESOC(=O)c1ccc(NC(=O)[C@@H]2CC[C@@H]3CN2C(=O)N3OS(O)(=O)=O)cc1