Reaction Details
TargetOxa40
LigandBDBM50447648
Substrate/Competitorn/a
Meas. Tech.ChEMBL_1289443 (CHEMBL3117137)
IC50>50000±n/a nM
Citation Blizzard, TAChen, HKim, SWu, JBodner, RGude, CImbriglio, JYoung, KPark, YWOgawa, ARaghoobar, SHairston, NPainter, REWisniewski, DScapin, GFitzgerald, PSharma, NLu, JHa, SHermes, JHammond, ML Discovery of MK-7655, aß-lactamase inhibitor for combination with Primaxin®. Bioorg Med Chem Lett24:780-5 (2014) 
 
Oxa40
Name:Oxa40
Type:Enzyme
Mol. Mass.:30946.50
Organism:Acinetobacter baumannii
Description:Q8RLA6
Residue:275
BDBM50447648
NameBDBM50447648
Synonyms:CHEMBL3112750
TypeSmall organic molecule
Emp. Form.C13H16N4O6S
Mol. Mass.356.354
SMILESCn1ccc(cc1)=[NH+]C(=O)[C@@H]1CC[C@@H]2CN1C(=O)N2OS([O-])(=O)=O