Reaction Details
TargetHistone-lysine N-methyltransferase EHMT1
LigandBDBM50448486
Substrate/Competitorn/a
Meas. Tech.ChEMBL_1294378 (CHEMBL3129163)
IC50 400000±n/a nM
Citation Valente, SLiu, YSchnekenburger, MZwergel, CCosconati, SGros, CTardugno, MLabella, DFlorean, CMinden, SHashimoto, HChang, YZhang, XKirsch, GNovellino, EArimondo, PBMiele, EFerretti, EGulino, ADiederich, MCheng, XMai, A Selective non-nucleoside inhibitors of human DNA methyltransferases active in cancer including in cancer stem cells. J Med Chem57:701-13 (2014) 
 
Histone-lysine N-methyltransferase EHMT1
Name:Histone-lysine N-methyltransferase EHMT1
Type:PROTEIN
Mol. Mass.:141443.67
Organism:Homo sapiens (Human)
Description:ChEMBL_1450367
Residue:1298
BDBM50448486
NameBDBM50448486
Synonyms:CHEMBL3126644
TypeSmall organic molecule
Emp. Form.C27H23N7O
Mol. Mass.461.5178
SMILESCc1cc(Nc2ccccc2NC(=O)c2ccc(Nc3ccnc4ccccc34)cc2)nc(N)n1