Reaction Details
TargetCoagulation factor X
LigandBDBM50448580
Substrate/Competitorn/a
Meas. Tech.ChEMBL_1296330 (CHEMBL3129589)
Ki 9300±n/a nM
Citation Quan, MLWong, PCWang, CWoerner, FSmallheer, JMBarbera, FABozarth, JMBrown, RLHarpel, MRLuettgen, JMMorin, PEPeterson, TRamamurthy, VRendina, ARRossi, KAWatson, CAWei, AZhang, GSeiffert, DWexler, RR Tetrahydroquinoline derivatives as potent and selective factor XIa inhibitors. J Med Chem57:955-69 (2014) 
 
Coagulation factor X
Name:Coagulation factor X
Type:Enzyme
Mol. Mass.:54726.60
Organism:Homo sapiens (Human)
Description:n/a
Residue:488
BDBM50448580
NameBDBM50448580
Synonyms:CHEMBL3127470
TypeSmall organic molecule
Emp. Form.C31H27N3O4
Mol. Mass.505.5638
SMILESC[C@@]1(C[C@H](Nc2ccc(cc12)C(N)=N)c1cccc(c1)-c1ccc(cc1C(O)=O)C(O)=O)c1ccccc1