Reaction Details
TargetCoagulation factor X
LigandBDBM50448595
Substrate/Competitorn/a
Meas. Tech.ChEMBL_1296330 (CHEMBL3129589)
Ki 5810±n/a nM
Citation Quan, MLWong, PCWang, CWoerner, FSmallheer, JMBarbera, FABozarth, JMBrown, RLHarpel, MRLuettgen, JMMorin, PEPeterson, TRamamurthy, VRendina, ARRossi, KAWatson, CAWei, AZhang, GSeiffert, DWexler, RR Tetrahydroquinoline derivatives as potent and selective factor XIa inhibitors. J Med Chem57:955-69 (2014) 
 
Coagulation factor X
Name:Coagulation factor X
Type:Enzyme
Mol. Mass.:54726.60
Organism:Homo sapiens (Human)
Description:n/a
Residue:488
BDBM50448595
NameBDBM50448595
Synonyms:CHEMBL3127479
TypeSmall organic molecule
Emp. Form.C32H30N4O3
Mol. Mass.518.6056
SMILESCC(=O)Nc1ccc(-c2cccc(c2)[C@@H]2C[C@](C)(c3ccccc3)c3cc(ccc3N2)C(N)=N)c(c1)C(O)=O