Reaction Details
TargetCoagulation factor XI
LigandBDBM50448598
Substrate/Competitorn/a
Meas. Tech.ChEMBL_1296332 (CHEMBL3129742)
Ki 64±n/a nM
Citation Quan, MLWong, PCWang, CWoerner, FSmallheer, JMBarbera, FABozarth, JMBrown, RLHarpel, MRLuettgen, JMMorin, PEPeterson, TRamamurthy, VRendina, ARRossi, KAWatson, CAWei, AZhang, GSeiffert, DWexler, RR Tetrahydroquinoline derivatives as potent and selective factor XIa inhibitors. J Med Chem57:955-69 (2014) 
 
Coagulation factor XI
Name:Coagulation factor XI
Type:Enzyme
Mol. Mass.:70130.58
Organism:Homo sapiens (Human)
Description:P03951
Residue:625
BDBM50448598
NameBDBM50448598
Synonyms:CHEMBL3127476
TypeSmall organic molecule
Emp. Form.C30H28N4O2
Mol. Mass.476.5689
SMILESC[C@@]1(C[C@H](Nc2ccc(cc12)C(N)=N)c1cccc(c1)-c1ccc(N)cc1C(O)=O)c1ccccc1