Reaction Details
TargetCoagulation factor XI
LigandBDBM50448605
Substrate/Competitorn/a
Meas. Tech.ChEMBL_1296332 (CHEMBL3129742)
Ki 3.9±n/a nM
Citation Quan, MLWong, PCWang, CWoerner, FSmallheer, JMBarbera, FABozarth, JMBrown, RLHarpel, MRLuettgen, JMMorin, PEPeterson, TRamamurthy, VRendina, ARRossi, KAWatson, CAWei, AZhang, GSeiffert, DWexler, RR Tetrahydroquinoline derivatives as potent and selective factor XIa inhibitors. J Med Chem57:955-69 (2014) 
 
Coagulation factor XI
Name:Coagulation factor XI
Type:Enzyme
Mol. Mass.:70130.58
Organism:Homo sapiens (Human)
Description:P03951
Residue:625
BDBM50448605
NameBDBM50448605
Synonyms:CHEMBL3127469
TypeSmall organic molecule
Emp. Form.C30H25N3O4
Mol. Mass.491.5372
SMILESNC(=N)c1ccc2N[C@@H](C[C@H](c3ccccc3)c2c1)c1cccc(c1)-c1ccc(cc1C(O)=O)C(O)=O