Reaction Details
TargetCoagulation factor X
LigandBDBM50448608
Substrate/Competitorn/a
Meas. Tech.ChEMBL_1296330 (CHEMBL3129589)
Ki 970±n/a nM
Citation Quan, MLWong, PCWang, CWoerner, FSmallheer, JMBarbera, FABozarth, JMBrown, RLHarpel, MRLuettgen, JMMorin, PEPeterson, TRamamurthy, VRendina, ARRossi, KAWatson, CAWei, AZhang, GSeiffert, DWexler, RR Tetrahydroquinoline derivatives as potent and selective factor XIa inhibitors. J Med Chem57:955-69 (2014) 
 
Coagulation factor X
Name:Coagulation factor X
Type:Enzyme
Mol. Mass.:54726.60
Organism:Homo sapiens (Human)
Description:n/a
Residue:488
BDBM50448608
NameBDBM50448608
Synonyms:CHEMBL3127466
TypeSmall organic molecule
Emp. Form.C30H25N3O4
Mol. Mass.491.5372
SMILESNC(=N)c1ccc2N[C@@H](C[C@H](c3ccccc3)c2c1)c1ccccc1-c1ccc(cc1C(O)=O)C(O)=O