Reaction Details
TargetBDNF/NT-3 growth factors receptor
LigandBDBM50448785
Substrate/Competitorn/a
Meas. Tech.ChEMBL_1294433 (CHEMBL3129259)
IC50 4.0±n/a nM
Citation Huang, QJohnson, TWBailey, SBrooun, ABunker, KDBurke, BJCollins, MRCook, ASCui, JJDack, KNDeal, JGDeng, YLDinh, DEngstrom, LDHe, MHoffman, JHoffman, RLJohnson, PSKania, RSLam, HLam, JLLe, PTLi, QLingardo, LLiu, WLu, MWMcTigue, MPalmer, CLRichardson, PFSach, NWShen, HSmeal, TSmith, GLStewart, AETimofeevski, STsaparikos, KWang, HZhu, HZhu, JZou, HYEdwards, MP Design of potent and selective inhibitors to overcome clinical anaplastic lymphoma kinase mutations resistant to crizotinib. J Med Chem57:1170-87 (2014) 
 
BDNF/NT-3 growth factors receptor
Name:BDNF/NT-3 growth factors receptor
Type:Enzyme
Mol. Mass.:91996.87
Organism:Homo sapiens (Human)
Description:Q16620
Residue:822
BDBM50448785
NameBDBM50448785
Synonyms:CHEMBL3128069
TypeSmall organic molecule
Emp. Form.C22H23FN6O3S
Mol. Mass.470.52
SMILESC[C@@H](Oc1cc(cnc1N)-c1sc(nc1C)[C@](C)(O)CO)c1cc(F)ccc1-n1nccn1