Reaction Details
TargetTyrosine-protein kinase JAK2
LigandBDBM50331809
Substrate/Competitorn/a
Meas. Tech.ChEMBL_1297186 (CHEMBL3131375)
IC50 40±n/a nM
Citation Siu, TKumarasinghe, SEAltman, MDKatcher, MNorthrup, AWhite, CRosenstein, CMathur, AXu, LChan, GBachman, EBouthillette, MDinsmore, CJMarshall, CGYoung, JR The discovery of reverse tricyclic pyridone JAK2 inhibitors. Part 2: lead optimization. Bioorg Med Chem Lett24:1466-71 (2014) 
 
Tyrosine-protein kinase JAK2
Name:Tyrosine-protein kinase JAK2
Type:Protein
Mol. Mass.:130684.68
Organism:Homo sapiens (Human)
Description:O60674
Residue:1132
BDBM50331809
NameBDBM50331809
Synonyms:(R)-6-(1,1,1-trifluoro-3-methylbutan-2-ylamino)pyrido[4,3-c][1,6]naphthyridin-1(2H)-one | CHEMBL1289218
TypeSmall organic molecule
Emp. Form.C16H15F3N4O
Mol. Mass.336.3117
SMILESCC(C)[C@@H](Nc1nc2cc[nH]c(=O)c2c2cnccc12)C(F)(F)F