Reaction Details
TargetCholinesterase
LigandBDBM50005189
Substrate/Competitorn/a
Meas. Tech.ChEMBL_1281568 (CHEMBL3102253)
Ki 62±n/a nM
Citation Butini, SBrindisi, MBrogi, SMaramai, SGuarino, EPanico, ASaxena, AChauhan, VColombo, RVerga, LDe Lorenzi, EBartolini, MAndrisano, VNovellino, ECampiani, GGemma, S Multifunctional cholinesterase and amyloid Beta fibrillization modulators. Synthesis and biological investigation. ACS Med Chem Lett4:1178-82 (2013) 
 
Cholinesterase
Name:Cholinesterase
Type:Homotetramer
Mol. Mass.:68422.27
Organism:Homo sapiens (Human)
Description:P06276
Residue:602
BDBM50005189
NameBDBM50005189
Synonyms:CHEMBL3099499
TypeSmall organic molecule
Emp. Form.C67H78N10O8
Mol. Mass.1151.3984
SMILESCN(CCCCNc1c2CCCCc2nc2ccccc12)CCCNc1c2CCCCc2nc2c(NC(=O)CNC(=O)CC[C@H](NC(=O)CNC(=O)OCc3ccccc3)C(=O)N[C@@H](Cc3ccccc3)C(=O)OCc3ccccc3)cccc12