Reaction Details
TargetAcetylcholinesterase
LigandBDBM50005188
Substrate/Competitorn/a
Meas. Tech.ChEMBL_1281569 (CHEMBL3102254)
Ki 1.5±n/a nM
Citation Butini, SBrindisi, MBrogi, SMaramai, SGuarino, EPanico, ASaxena, AChauhan, VColombo, RVerga, LDe Lorenzi, EBartolini, MAndrisano, VNovellino, ECampiani, GGemma, S Multifunctional cholinesterase and amyloid Beta fibrillization modulators. Synthesis and biological investigation. ACS Med Chem Lett4:1178-82 (2013) 
 
Acetylcholinesterase
Name:Acetylcholinesterase
Type:Enzyme
Mol. Mass.:67792.70
Organism:Homo sapiens (Human)
Description:P22303
Residue:614
BDBM50005188
NameBDBM50005188
Synonyms:CHEMBL3099500
TypeSmall organic molecule
Emp. Form.C67H78N10O8
Mol. Mass.1151.3984
SMILESCN(CCCCNc1c2CCCCc2nc2c(NC(=O)CNC(=O)CC[C@H](NC(=O)CNC(=O)OCc3ccccc3)C(=O)N[C@@H](Cc3ccccc3)C(=O)OCc3ccccc3)cccc12)CCCNc1c2CCCCc2nc2ccccc12