Reaction Details
TargetDiacylglycerol O-acyltransferase 1
LigandBDBM50003857
Substrate/Competitorn/a
Meas. Tech.ChEMBL_1336096 (CHEMBL3240807)
IC50 6.0±n/a nM
Citation Fox, BMSugimoto, KIio, KYoshida, AZhang, JKLi, KHao, XLabelle, MSmith, MLRubenstein, SMYe, GMcMinn, DJackson, SChoi, RShan, BMa, JMiao, SMatsui, TOgawa, NSuzuki, MKobayashi, AOzeki, HOkuma, CIshii, YTomimoto, DFurakawa, NTanaka, MMatsushita, MTakahashi, MInaba, TSagawa, SKayser, F Discovery of 6-phenylpyrimido[4,5-b][1,4]oxazines as potent and selective acyl CoA:diacylglycerol acyltransferase 1 (DGAT1) inhibitors with in vivo efficacy in rodents. J Med Chem57:3464-83 (2014) 
 
Diacylglycerol O-acyltransferase 1
Name:Diacylglycerol O-acyltransferase 1
Type:Protein
Mol. Mass.:55297.82
Organism:Homo sapiens (Human)
Description:O75907
Residue:488
BDBM50003857
NameBDBM50003857
Synonyms:CHEMBL3235314
TypeSmall organic molecule
Emp. Form.C23H28N4O3
Mol. Mass.408.4934
SMILESCC1(C)Oc2ncnc(N)c2N=C1c1ccc(cc1)[C@H]1CC[C@H](CCC(O)=O)CC1