Reaction Details
TargetThyroid hormone receptor beta
LigandBDBM18860
Substrate/Competitorn/a
Meas. Tech.ChEMBL_1351953 (CHEMBL3266217)
EC50 15±n/a nM
Citation Kelly, MJPietranico-Cole, SLarigan, JDHaynes, NEReynolds, CHScott, NVermeulen, JDvorozniak, MConde-Knape, KHuang, KSSo, SSThakkar, KQian, YBanner, BMennona, FDanzi, SKlein, ITaub, RTilley, J Discovery of 2-[3,5-dichloro-4-(5-isopropyl-6-oxo-1,6-dihydropyridazin-3-yloxy)phenyl]-3,5-dioxo-2,3,4,5-tetrahydro[1,2,4]triazine-6-carbonitrile (MGL-3196), a Highly Selective Thyroid Hormone Receptorß agonist in clinical trials for the treatment of dyslipidemia. J Med Chem57:3912-23 (2014) 
 
Thyroid hormone receptor beta
Name:Thyroid hormone receptor beta
Type:Receptor
Mol. Mass.:52793.62
Organism:Homo sapiens (Human)
Description:Recombinant hThR was obtained from nuclear extracts from SF9 cells infected with baculovirus vectors encoding for ThRbeta 1.
Residue:461
BDBM18860
NameBDBM18860
Synonyms:(2R)-2-amino-3-[4-(4-hydroxy-3-iodophenoxy)-3,5-diiodophenyl]propanoic acid 3,5,3'-triiodo-L-thyronine (T3) Triiodothyronine US10544075, Compound T3 liothyronine | triothyrone
TypeHormone
Emp. Form.C15H12I3NO4
Mol. Mass.650.9735
SMILESN[C@@H](Cc1cc(I)c(Oc2ccc(O)c(I)c2)c(I)c1)C(O)=O