Reaction Details
TargetcAMP and cAMP-inhibited cGMP 3',5'-cyclic phosphodiesterase 10A
LigandBDBM31596
Substrate/Competitorn/a
Meas. Tech.ChEMBL_1350908 (CHEMBL3268063)
IC50 1.4±n/a nM
Citation Das, SHarde, RLShelke, DEKhairatkar-Joshi, NBajpai, MSapalya, RSSurve, HVGudi, GSPattem, RBehera, DBJadhav, SBThomas, A Design, synthesis and pharmacological evaluation of novel polycyclic heteroarene ethers as PDE10A inhibitors: Part I. Bioorg Med Chem Lett24:2073-8 (2014) 
 
cAMP and cAMP-inhibited cGMP 3',5'-cyclic phosphodiesterase 10A
Name:cAMP and cAMP-inhibited cGMP 3',5'-cyclic phosphodiesterase 10A
Type:Protein
Mol. Mass.:88412.52
Organism:Homo sapiens (Human)
Description:Q9Y233
Residue:1055
BDBM31596
NameBDBM31596
Synonyms:substituted pyrazole, 13
TypeSmall organic molecule
Emp. Form.C26H19F3N4O
Mol. Mass.460.4505
SMILESFC(F)(F)Cn1cc(c(n1)-c1ccc(OCc2ccc3ccccc3n2)cc1)-c1ccncc1