Reaction Details
TargetTyrosine-protein kinase Lyn
LigandBDBM60665
Substrate/Competitorn/a
Meas. Tech.ChEMBL_1348045 (CHEMBL3268709)
IC50 732±n/a nM
Citation Thoma, GBlanz, JBühlmayer, PDrückes, PKittelmann, MSmith, ABvan Eis, MVangrevelinghe, EZerwes, HGChe, JJHe, XJin, YLee, CCMichellys, PYUno, TLiu, H Syk inhibitors with high potency in presence of blood. Bioorg Med Chem Lett24:2278-82 (2014) 
 
Tyrosine-protein kinase Lyn
Name:Tyrosine-protein kinase Lyn
Type:Protein
Mol. Mass.:58575.92
Organism:Homo sapiens (Human)
Description:P07948
Residue:512
BDBM60665
NameBDBM60665
Synonyms:BDBM50249542 US9212178, R406
Typen/a
Emp. Form.C22H23FN6O5
Mol. Mass.470.4536
SMILESCOc1cc(Nc2ncc(F)c(Nc3ccc4OC(C)(C)C(=O)Nc4n3)n2)cc(OC)c1OC