Reaction Details
TargetTyrosine-protein kinase Lyn
LigandBDBM50013165
Substrate/Competitorn/a
Meas. Tech.ChEMBL_1348045 (CHEMBL3268709)
IC50 32±n/a nM
Citation Thoma, GBlanz, JBühlmayer, PDrückes, PKittelmann, MSmith, ABvan Eis, MVangrevelinghe, EZerwes, HGChe, JJHe, XJin, YLee, CCMichellys, PYUno, TLiu, H Syk inhibitors with high potency in presence of blood. Bioorg Med Chem Lett24:2278-82 (2014) 
 
Tyrosine-protein kinase Lyn
Name:Tyrosine-protein kinase Lyn
Type:Protein
Mol. Mass.:58575.92
Organism:Homo sapiens (Human)
Description:P07948
Residue:512
BDBM50013165
NameBDBM50013165
Synonyms:CHEMBL3262616
TypeSmall organic molecule
Emp. Form.C21H23N7O
Mol. Mass.389.4536
SMILESN[C@H]1CCCC[C@H]1Nc1cc2nc[nH]c(=O)c2c(Nc2cccc3[nH]ccc23)n1