Reaction Details
TargetTyrosine-protein kinase ZAP-70
LigandBDBM50013170
Substrate/Competitorn/a
Meas. Tech.ChEMBL_1348046 (CHEMBL3268710)
IC50 18±n/a nM
Citation Thoma, GBlanz, JBühlmayer, PDrückes, PKittelmann, MSmith, ABvan Eis, MVangrevelinghe, EZerwes, HGChe, JJHe, XJin, YLee, CCMichellys, PYUno, TLiu, H Syk inhibitors with high potency in presence of blood. Bioorg Med Chem Lett24:2278-82 (2014) 
 
Tyrosine-protein kinase ZAP-70
Name:Tyrosine-protein kinase ZAP-70
Type:Enzyme
Mol. Mass.:69881.61
Organism:Homo sapiens (Human)
Description:ZAP-70 SH2 domain was expressed and purified from E. coli using O-phospho-L-tyrosine-agarose column.
Residue:619
BDBM50013170
NameBDBM50013170
Synonyms:CHEMBL3262622
TypeSmall organic molecule
Emp. Form.C21H23N7O2
Mol. Mass.405.453
SMILESCn1cc2c(Nc3nc(N[C@@H]4CCOC[C@@H]4N)cc4cc[nH]c(=O)c34)cccc2n1