Reaction Details
TargetTyrosine-protein kinase JAK2
LigandBDBM50013160
Substrate/Competitorn/a
Meas. Tech.ChEMBL_1348047 (CHEMBL3268711)
IC50 120±n/a nM
Citation Thoma, GBlanz, JBühlmayer, PDrückes, PKittelmann, MSmith, ABvan Eis, MVangrevelinghe, EZerwes, HGChe, JJHe, XJin, YLee, CCMichellys, PYUno, TLiu, H Syk inhibitors with high potency in presence of blood. Bioorg Med Chem Lett24:2278-82 (2014) 
 
Tyrosine-protein kinase JAK2
Name:Tyrosine-protein kinase JAK2
Type:Protein
Mol. Mass.:130684.68
Organism:Homo sapiens (Human)
Description:O60674
Residue:1132
BDBM50013160
NameBDBM50013160
Synonyms:CHEMBL3262355
TypeSmall organic molecule
Emp. Form.C21H23N9O
Mol. Mass.417.467
SMILESN[C@H]1CCCC[C@H]1Nc1cc2nc[nH]c(=O)c2c(Nc2cccc(c2)-n2nccn2)n1