Reaction Details
TargetE3 ubiquitin-protein ligase Mdm2
LigandBDBM50018541
Substrate/Competitorn/a
Meas. Tech.ChEMBL_1362099 (CHEMBL3294652)
Ki 260±n/a nM
Citation Li, JWu, YGuo, ZZhuang, CYao, JDong, GYu, ZMin, XWang, SLiu, YWu, SZhu, SSheng, CMiao, ZZhang, W Discovery of 1-arylpyrrolidone derivatives as potent p53-MDM2 inhibitors based on molecule fusing strategy. Bioorg Med Chem Lett24:2648-50 (2014) 
 
E3 ubiquitin-protein ligase Mdm2
Name:E3 ubiquitin-protein ligase Mdm2
Type:Oncoprotein
Mol. Mass.:55196.54
Organism:Homo sapiens (Human)
Description:Q00987
Residue:491
BDBM50018541
NameBDBM50018541
Synonyms:CHEMBL2180122
TypeSmall organic molecule
Emp. Form.C26H26BrN3O3
Mol. Mass.508.407
SMILESCC(C)OC1=C(C(N(CCCn2ccnc2)C1=O)c1ccc(Br)cc1)C(=O)c1ccccc1