Reaction Details
TargetE3 ubiquitin-protein ligase Mdm2
LigandBDBM50018543
Substrate/Competitorn/a
Meas. Tech.ChEMBL_1362099 (CHEMBL3294652)
Ki 90±n/a nM
Citation Li, JWu, YGuo, ZZhuang, CYao, JDong, GYu, ZMin, XWang, SLiu, YWu, SZhu, SSheng, CMiao, ZZhang, W Discovery of 1-arylpyrrolidone derivatives as potent p53-MDM2 inhibitors based on molecule fusing strategy. Bioorg Med Chem Lett24:2648-50 (2014) 
 
E3 ubiquitin-protein ligase Mdm2
Name:E3 ubiquitin-protein ligase Mdm2
Type:Oncoprotein
Mol. Mass.:55196.54
Organism:Homo sapiens (Human)
Description:Q00987
Residue:491
BDBM50018543
NameBDBM50018543
Synonyms:CHEMBL3290677
TypeSmall organic molecule
Emp. Form.C36H32BrF3N2O3
Mol. Mass.677.55
SMILESCC(C)Oc1cc(ccc1CN1C(C(C(=O)c2ccccc2)=C(N[C@H](C)c2ccccc2)C1=O)c1ccc(Br)cc1)C(F)(F)F