Reaction Details
Target11-beta-hydroxysteroid dehydrogenase 1
LigandBDBM50018803
Substrate/Competitorn/a
Meas. Tech.ChEMBL_1362859 (CHEMBL3291633)
IC50 15±n/a nM
Citation Gillespie, PPietranico-Cole, SMyers, MBilotta, JAConde-Knape, KFotouhi, NGoodnow, RAGuertin, KRHamilton, MMHaynes, NELiu, BQi, LRen, YScott, NRSo, SSSpence, CTaub, RThakkar, KTilley, JWZwingelstein, C Discovery of camphor-derived pyrazolones as 11ß-hydroxysteroid dehydrogenase type 1 inhibitors. Bioorg Med Chem Lett24:2707-11 (2014) 
 
11-beta-hydroxysteroid dehydrogenase 1
Name:11-beta-hydroxysteroid dehydrogenase 1
Type:Enzyme
Mol. Mass.:32409.16
Organism:Homo sapiens (Human)
Description:P28845
Residue:292
BDBM50018803
NameBDBM50018803
Synonyms:CHEMBL3291358
TypeSmall organic molecule
Emp. Form.C26H30N2O
Mol. Mass.386.5292
SMILES[H][C@@]12CC[C@@](C)(c3c1c(=O)n(Cc1cccc(c1)-c1ccccc1C)n3C)C2(C)C