Reaction Details
TargetCytochrome P450 2C19
LigandBDBM50022085
Substrate/Competitorn/a
Meas. Tech.ChEMBL_1367429 (CHEMBL3300783)
IC50 290±n/a nM
Citation Kang, SKim, RYSeo, MJLee, SKim, YMSeo, MSeo, JJKo, YChoi, IJang, JNam, JPark, SKang, HKim, HJKim, JAhn, SPethe, KNam, KNo, ZKim, J Lead optimization of a novel series of imidazo[1,2-a]pyridine amides leading to a clinical candidate (Q203) as a multi- and extensively-drug-resistant anti-tuberculosis agent. J Med Chem57:5293-305 (2014) 
 
Cytochrome P450 2C19
Name:Cytochrome P450 2C19
Type:Enzyme
Mol. Mass.:55935.47
Organism:Homo sapiens (Human)
Description:P33261
Residue:490
BDBM50022085
NameBDBM50022085
Synonyms:CHEMBL3298909
TypeSmall organic molecule
Emp. Form.C29H28ClF3N4O2
Mol. Mass.557.006
SMILESCCc1nc2cc(Cl)ccn2c1C(=O)NCc1ccc(cc1)N1CCC(CC1)c1ccc(OC(F)(F)F)cc1