Reaction Details
TargetCholinesterase
LigandBDBM10960
Substrate/Competitorn/a
Meas. Tech.ChEMBL_1442172 (CHEMBL3375245)
IC50 50±n/a nM
Citation Brus, BKo?ak, UTurk, SPi?lar, ACoquelle, NKos, JStojan, JColletier, JPGobec, S Discovery, biological evaluation, and crystal structure of a novel nanomolar selective butyrylcholinesterase inhibitor. J Med Chem57:8167-79 (2014) 
 
Cholinesterase
Name:Cholinesterase
Type:Homotetramer
Mol. Mass.:68422.27
Organism:Homo sapiens (Human)
Description:P06276
Residue:602
BDBM10960
NameBDBM10960
Synonyms:(3aS,8aR)-1,3a,8-trimethyl-1H,2H,3H,3aH,8H,8aH-pyrrolo[2,3-b]indol-5-yl N-[4-(propan-2-yl)phenyl]carbamate Cymserine | cymserine.tartaric acid
TypeSmall organic molecule
Emp. Form.C23H29N3O2
Mol. Mass.379.4953
SMILES[H][C@]12N(C)CC[C@@]1(C)c1cc(OC(=O)Nc3ccc(cc3)C(C)C)ccc1N2C