Reaction Details
TargetProthrombin
LigandBDBM50029091
Substrate/Competitorn/a
Meas. Tech.ChEMBL_1435546 (CHEMBL3385911)
Ki 18±n/a nM
Citation Belviso, BDCaliandro, Rde Candia, MZaetta, GLopopolo, GIncampo, FColucci, MAltomare, CD How aß-D-glucoside side chain enhances binding affinity to thrombin of inhibitors bearing 2-chlorothiophene as P1 moiety: crystallography, fragment deconstruction study, and evaluation of antithrombotic properties. J Med Chem57:8563-75 (2014) 
 
Prothrombin
Name:Prothrombin
Type:Enzyme
Mol. Mass.:70502.73
Organism:Bos taurus (Bovine)
Description:P00735
Residue:625
BDBM50029091
NameBDBM50029091
Synonyms:CHEMBL3343299
TypeSmall organic molecule
Emp. Form.C23H26ClN3O3S
Mol. Mass.459.989
SMILESCC(C)N1CCC(CC1)C(=O)Nc1ccccc1OCc1cc(on1)-c1ccc(Cl)s1