Reaction Details
TargetProthrombin
LigandBDBM50029092
Substrate/Competitorn/a
Meas. Tech.ChEMBL_1435544 (CHEMBL3385909)
Ki 133000±n/a nM
Citation Belviso, BDCaliandro, Rde Candia, MZaetta, GLopopolo, GIncampo, FColucci, MAltomare, CD How aß-D-glucoside side chain enhances binding affinity to thrombin of inhibitors bearing 2-chlorothiophene as P1 moiety: crystallography, fragment deconstruction study, and evaluation of antithrombotic properties. J Med Chem57:8563-75 (2014) 
 
Prothrombin
Name:Prothrombin
Type:Enzyme
Mol. Mass.:70502.73
Organism:Bos taurus (Bovine)
Description:P00735
Residue:625
BDBM50029092
NameBDBM50029092
Synonyms:CHEMBL3343304
TypeSmall organic molecule
Emp. Form.C23H27ClN2O9S
Mol. Mass.542.986
SMILESNc1c(OCCCO[C@@H]2O[C@H](CO)[C@@H](O)[C@H](O)[C@H]2O)cccc1OCc1cc(on1)-c1ccc(Cl)s1