Reaction Details
TargetProthrombin
LigandBDBM50029095
Substrate/Competitorn/a
Meas. Tech.ChEMBL_1435544 (CHEMBL3385909)
Ki 160±n/a nM
Citation Belviso, BDCaliandro, Rde Candia, MZaetta, GLopopolo, GIncampo, FColucci, MAltomare, CD How aß-D-glucoside side chain enhances binding affinity to thrombin of inhibitors bearing 2-chlorothiophene as P1 moiety: crystallography, fragment deconstruction study, and evaluation of antithrombotic properties. J Med Chem57:8563-75 (2014) 
 
Prothrombin
Name:Prothrombin
Type:Enzyme
Mol. Mass.:70502.73
Organism:Bos taurus (Bovine)
Description:P00735
Residue:625
BDBM50029095
NameBDBM50029095
Synonyms:CHEMBL3343300
TypeSmall organic molecule
Emp. Form.C40H50ClN3O14S
Mol. Mass.864.355
SMILESCC(C)N1CCC(CC1)C(=O)Nc1c(OCCCO[C@@H]2O[C@H](COC(C)=O)[C@@H](OC(C)=O)[C@H](OC(C)=O)[C@H]2OC(C)=O)cccc1OCc1cc(on1)-c1ccc(Cl)s1