Reaction Details
TargetCoagulation factor X
LigandBDBM50029094
Substrate/Competitorn/a
Meas. Tech.ChEMBL_1435543 (CHEMBL3385908)
Ki 11600±n/a nM
Citation Belviso, BDCaliandro, Rde Candia, MZaetta, GLopopolo, GIncampo, FColucci, MAltomare, CD How aß-D-glucoside side chain enhances binding affinity to thrombin of inhibitors bearing 2-chlorothiophene as P1 moiety: crystallography, fragment deconstruction study, and evaluation of antithrombotic properties. J Med Chem57:8563-75 (2014) 
 
Coagulation factor X
Name:Coagulation factor X
Type:Enzyme
Mol. Mass.:54726.60
Organism:Homo sapiens (Human)
Description:n/a
Residue:488
BDBM50029094
NameBDBM50029094
Synonyms:CHEMBL3343302
TypeSmall organic molecule
Emp. Form.C14H11ClN2O2S
Mol. Mass.306.767
SMILESNc1ccccc1OCc1cc(on1)-c1ccc(Cl)s1