Reaction Details
TargetIsocitrate dehydrogenase [NADP] cytoplasmic
LigandBDBM50029488
Substrate/Competitorn/a
Meas. Tech.ChEMBL_1436947 (CHEMBL3389006)
Ki 800±n/a nM
Citation Liu, ZYao, YKogiso, MZheng, BDeng, LQiu, JJDong, SLv, HGallo, JMLi, XNSong, Y Inhibition of cancer-associated mutant isocitrate dehydrogenases: synthesis, structure-activity relationship, and selective antitumor activity. J Med Chem57:8307-18 (2014) 
 
Isocitrate dehydrogenase [NADP] cytoplasmic
Name:Isocitrate dehydrogenase [NADP] cytoplasmic
Type:Protein
Mol. Mass.:46661.29
Organism:Homo sapiens (Human)
Description:O75874
Residue:414
BDBM50029488
NameBDBM50029488
Synonyms:CHEMBL3343462
TypeSmall organic molecule
Emp. Form.C20H19NO3
Mol. Mass.321.3698
SMILESCOc1ccc(cc1)-c1ccc(Cc2cc(C)cc(=O)n2O)cc1