Reaction Details
TargetCoagulation factor VII
LigandBDBM50032865
Substrate/Competitorn/a
Meas. Tech.ChEMBL_1443464 (CHEMBL3377178)
Ki>10900±n/a nM
Citation Hangeland, JJFriends, TJRossi, KASmallheer, JMWang, CSun, ZCorte, JRFang, TWong, PCRendina, ARBarbera, FABozarth, JMLuettgen, JMWatson, CAZhang, GWei, ARamamurthy, VMorin, PEBisacchi, GSSubramaniam, SArunachalam, PMathur, ASeiffert, DAWexler, RRQuan, ML Phenylimidazoles as potent and selective inhibitors of coagulation factor XIa with in vivo antithrombotic activity. J Med Chem57:9915-32 (2014) 
 
Coagulation factor VII
Name:Coagulation factor VII
Type:Enzyme
Mol. Mass.:51599.89
Organism:Homo sapiens (Human)
Description:n/a
Residue:466
BDBM50032865
NameBDBM50032865
Synonyms:CHEMBL3355665
TypeSmall organic molecule
Emp. Form.C28H30F3N5O3
Mol. Mass.541.5647
SMILESOC(=O)C(F)(F)F.NC[C@H]1CC[C@@H](CC1)C(=O)N[C@@H](Cc1ccccc1)c1nc(c[nH]1)-c1ccc(cc1)C#N